{"text_format":"1","workbook":"xlsx","n_sheets":3,"sheets":["８ビットコンピュータ","アプリ","仕様"],"not_rendered":{"charts":0,"images":6,"macros":1,"external_links":0,"defined_names":0,"comments":0,"pivot_tables":0},"unopened":[],"bounds":{"document_bytes":16777216,"sheet_cells":100000,"rows_first":2000,"rows_last":500,"rows_between":2000,"halvings":0,"cell_chars":16384,"cell_head_chars":4096},"cells_cut":0,"cells_raw":0,"read":"whole","date_system":"1900"}

{"sheet":"８ビットコンピュータ","index":0,"n_rows":34,"n_cols":93,"rows_kept":34,"cut":false,"hidden":false,"merged":[[11,2,14,9],[5,5,5,6],[4,5,4,7],[17,59,17,61],[26,12,26,14]]}
[null,null,null,null,null,null,null,"  ",null,null,null,null,null,"出力装置(OUTPUT)",null,null,null,null,null,null,null,null,23,24,null,null,null,null,null,null,null,null,null,null,null,null,null,null,null,null,null,null,null,null,null,null,null,null,null,null,null,null,null,null,null,null,null,null,null,null,"取り扱い説明書"]
[null,null,null,null,null,null,null,null,null,null,null,null,null,null,null,null,null,null,null,null,null,{"$f":"IF(U2=\"\",\"\",SUMPRODUCT(N2:U2,$C$27:$J$27))","v":""}]
[null,null,null,null,null,null,null,null,null,null,null,null,null,null,null,null,null,null,null,null,null,null,null,null,null,null,null,"補助記憶装置(HDDなど)",null,null,null,null,null,null,null,null,null,null,null,null,null,null,null,null,null,null,null,null,null,null,null,null,null,null,null,null,null,null,null,null,"…この色のセルの部分と、各ボタンの操作が可能です。"]
[null,null,"CPU",null,null,"8ビット",null,null,null,null,null,null,"主記憶装置（メインメモリ）",null,null,null,null,null,null,null,null,null,null,null,null,null,null,"プログラム①",null,null,null,null,null,null,null,null,null,null,null,null,null,null,null,"ブログラム②",null,null,null,null,null,null,null,null,null,null,null,null,null,null,null,"番号","命令セット","コード","説明"]
[null,null,"周波数",null,null,0.5,null,null,"Hz",null,null,null,"番地",null,null,null,null,null,"（16Bytes）",null,null,null,null,null,null,null,null,"命令","番地・値",null,null,null,null,1,2,3,4,5,6,7,8,null,null,"命令","番地・値",null,null,null,null,1,2,3,4,5,6,7,8,null,null,0,"値",0,"7ビットの整数(0～127)を扱えます。",null,null,null,null,null,{"$f":"IF(アプリ!G3=\"\",\"\",アプリ!G3)","v":"命令"},{"$f":"IF(アプリ!H3=\"\",\"\",アプリ!H3)","v":"番地・値"},{"$f":"IF(アプリ!I3=\"\",\"\",アプリ!I3)","v":""},{"$f":"IF(アプリ!J3=\"\",\"\",アプリ!J3)","v":""},{"$f":"IF(アプリ!K3=\"\",\"\",アプリ!K3)","v":""},{"$f":"IF(アプリ!L3=\"\",\"\",アプリ!L3)","v":"命令"},{"$f":"IF(アプリ!M3=\"\",\"\",アプリ!M3)","v":"番地・値"},{"$f":"IF(アプリ!N3=\"\",\"\",アプリ!N3)","v":""},{"$f":"IF(アプリ!O3=\"\",\"\",アプリ!O3)","v":""},{"$f":"IF(アプリ!P3=\"\",\"\",アプリ!P3)","v":""},{"$f":"IF(アプリ!Q3=\"\",\"\",アプリ!Q3)","v":"命令"},{"$f":"IF(アプリ!R3=\"\",\"\",アプリ!R3)","v":"番地・値"},{"$f":"IF(アプリ!S3=\"\",\"\",アプリ!S3)","v":""},{"$f":"IF(アプリ!T3=\"\",\"\",アプリ!T3)","v":""},{"$f":"IF(アプリ!U3=\"\",\"\",アプリ!U3)","v":""},{"$f":"IF(アプリ!V3=\"\",\"\",アプリ!V3)","v":"命令"},{"$f":"IF(アプリ!W3=\"\",\"\",アプリ!W3)","v":"番地・値"},{"$f":"IF(アプリ!X3=\"\",\"\",アプリ!X3)","v":""},{"$f":"IF(アプリ!Y3=\"\",\"\",アプリ!Y3)","v":""},{"$f":"IF(アプリ!Z3=\"\",\"\",アプリ!Z3)","v":""},{"$f":"IF(アプリ!AA3=\"\",\"\",アプリ!AA3)","v":"命令"},{"$f":"IF(アプリ!AB3=\"\",\"\",アプリ!AB3)","v":"番地・値"},{"$f":"IF(アプリ!AC3=\"\",\"\",アプリ!AC3)","v":""},{"$f":"IF(アプリ!AD3=\"\",\"\",アプリ!AD3)","v":""},{"$f":"IF(アプリ!AE3=\"\",\"\",アプリ!AE3)","v":""}]
[null,null,null,null,null,1,null,"命令/クロック",null,null,null,null,0,null,null,null,null,null,null,null,null,null,{"$f":"N6&O6&P6&Q6","v":""},{"$f":"U6*1+T6*2+S6*4+R6*8","v":0},{"$f":"O6&P6&Q6&R6&S6&T6&U6","v":""},null,0,"READ A",10,{"$f":"IF(AB6=\"\",\"\",VLOOKUP(AB6,$BI$4:$BJ$13,2,FALSE))","v":1000},{"$f":"IF(AC6<16,DEC2BIN(AC6,4),0)","v":"1010"},{"$f":"DEC2BIN(AC6,7)","v":"0001010"},{"$f":"IF(OR(AD6=\"\",AE6=\"\"),\"\",IF(LEFT(AD6,1)=\"1\",AD6&AE6,AD6&AF6))","v":"10001010"},{"$f":"IF($AG6=\"\",0,MID($AG6,AH$5,1))","v":"1"},{"$f":"IF($AG6=\"\",0,MID($AG6,AI$5,1))","v":"0"},"0","0","1","0","1","0",null,0,null,null,{"$f":"IF(AR6=\"\",\"\",VLOOKUP(AR6,$BI$4:$BJ$13,2,FALSE))","v":""},{"$f":"IF(AS6<16,DEC2BIN(AS6,4),0)","v":"0000"},{"$f":"DEC2BIN(AS6,7)","v":"0000000"},{"$f":"IF(OR(AT6=\"\",AU6=\"\"),\"\",IF(LEFT(AT6,1)=\"1\",AT6&AU6,AT6&AV6))","v":""},{"$f":"IF($AW6=\"\",0,MID($AW6,AX$5,1))","v":0},{"$f":"IF($AW6=\"\",0,MID($AW6,AY$5,1))","v":0},0,0,0,0,0,0,null,null,8,"READ A",1000,"番地からレジスタAへ読み出し",null,null,null,null,{"$f":"IF(アプリ!F4=\"\",\"\",アプリ!F4)","v":0},{"$f":"IF(アプリ!G4=\"\",\"\",アプリ!G4)","v":"READ A"},{"$f":"IF(アプリ!H4=\"\",\"\",アプリ!H4)","v":10},{"$f":"IF(アプリ!I4=\"\",\"\",アプリ!I4)","v":""},{"$f":"IF(アプリ!J4=\"\",\"\",アプリ!J4)","v":""},{"$f":"IF(アプリ!K4=\"\",\"\",アプリ!K4)","v":0},{"$f":"IF(アプリ!L4=\"\",\"\",アプリ!L4)","v":"READ A"},{"$f":"IF(アプリ!M4=\"\",\"\",アプリ!M4)","v":10},{"$f":"IF(アプリ!N4=\"\",\"\",アプリ!N4)","v":""},{"$f":"IF(アプリ!O4=\"\",\"\",アプリ!O4)","v":""},{"$f":"IF(アプリ!P4=\"\",\"\",アプリ!P4)","v":0},{"$f":"IF(アプリ!Q4=\"\",\"\",アプリ!Q4)","v":"OUTPUT"},{"$f":"IF(アプリ!R4=\"\",\"\",アプリ!R4)","v":10},{"$f":"IF(アプリ!S4=\"\",\"\",アプリ!S4)","v":""},{"$f":"IF(アプリ!T4=\"\",\"\",アプリ!T4)","v":""},{"$f":"IF(アプリ!U4=\"\",\"\",アプリ!U4)","v":0},{"$f":"IF(アプリ!V4=\"\",\"\",アプリ!V4)","v":"READ A"},{"$f":"IF(アプリ!W4=\"\",\"\",アプリ!W4)","v":10},{"$f":"IF(アプリ!X4=\"\",\"\",アプリ!X4)","v":""},{"$f":"IF(アプリ!Y4=\"\",\"\",アプリ!Y4)","v":""},{"$f":"IF(アプリ!Z4=\"\",\"\",アプリ!Z4)","v":0},{"$f":"IF(アプリ!AA4=\"\",\"\",アプリ!AA4)","v":""},{"$f":"IF(アプリ!AB4=\"\",\"\",アプリ!AB4)","v":""},{"$f":"IF(アプリ!AC4=\"\",\"\",アプリ!AC4)","v":""},{"$f":"IF(アプリ!AD4=\"\",\"\",アプリ!AD4)","v":""},{"$f":"IF(アプリ!AE4=\"\",\"\",アプリ!AE4)","v":""}]
[null,"プログラムカウンタ",null,null,null,null,null,null,null,null,null,null,1,null,null,null,null,null,null,null,null,null,{"$f":"N7&O7&P7&Q7","v":""},{"$f":"U7*1+T7*2+S7*4+R7*8","v":0},"",null,1,"ADD A",11,1010,{"$f":"IF(AC7<16,DEC2BIN(AC7,4),0)","v":"1011"},{"$f":"DEC2BIN(AC7,7)","v":"0001011"},{"$f":"IF(OR(AD7=\"\",AE7=\"\"),\"\",IF(LEFT(AD7,1)=\"1\",AD7&AE7,AD7&AF7))","v":"10101011"},{"$f":"IF($AG7=\"\",0,MID($AG7,AH$5,1))","v":"1"},"0","1","0","1","0","1","1",null,1,null,null,"",{"$f":"IF(AS7<16,DEC2BIN(AS7,4),0)","v":"0000"},{"$f":"DEC2BIN(AS7,7)","v":"0000000"},{"$f":"IF(OR(AT7=\"\",AU7=\"\"),\"\",IF(LEFT(AT7,1)=\"1\",AT7&AU7,AT7&AV7))","v":""},{"$f":"IF($AW7=\"\",0,MID($AW7,AX$5,1))","v":0},0,0,0,0,0,0,0,null,null,9,"READ B",1001,"番地からレジスタBへ読み出し",null,null,null,null,{"$f":"IF(アプリ!F5=\"\",\"\",アプリ!F5)","v":1},{"$f":"IF(アプリ!G5=\"\",\"\",アプリ!G5)","v":"BITSHIFT A"},{"$f":"IF(アプリ!H5=\"\",\"\",アプリ!H5)","v":1},{"$f":"IF(アプリ!I5=\"\",\"\",アプリ!I5)","v":""},{"$f":"IF(アプリ!J5=\"\",\"\",アプリ!J5)","v":""},{"$f":"IF(アプリ!K5=\"\",\"\",アプリ!K5)","v":1},{"$f":"IF(アプリ!L5=\"\",\"\",アプリ!L5)","v":"ADD A"},{"$f":"IF(アプリ!M5=\"\",\"\",アプリ!M5)","v":11},{"$f":"IF(アプリ!N5=\"\",\"\",アプリ!N5)","v":""},{"$f":"IF(アプリ!O5=\"\",\"\",アプリ!O5)","v":""},{"$f":"IF(アプリ!P5=\"\",\"\",アプリ!P5)","v":1},{"$f":"IF(アプリ!Q5=\"\",\"\",アプリ!Q5)","v":"READ A"},{"$f":"IF(アプリ!R5=\"\",\"\",アプリ!R5)","v":10},{"$f":"IF(アプリ!S5=\"\",\"\",アプリ!S5)","v":""},{"$f":"IF(アプリ!T5=\"\",\"\",アプリ!T5)","v":""},{"$f":"IF(アプリ!U5=\"\",\"\",アプリ!U5)","v":1},{"$f":"IF(アプリ!V5=\"\",\"\",アプリ!V5)","v":"READ B"},{"$f":"IF(アプリ!W5=\"\",\"\",アプリ!W5)","v":10},{"$f":"IF(アプリ!X5=\"\",\"\",アプリ!X5)","v":""},{"$f":"IF(アプリ!Y5=\"\",\"\",アプリ!Y5)","v":""},{"$f":"IF(アプリ!Z5=\"\",\"\",アプリ!Z5)","v":1},{"$f":"IF(アプリ!AA5=\"\",\"\",アプリ!AA5)","v":""},{"$f":"IF(アプリ!AB5=\"\",\"\",アプリ!AB5)","v":""},{"$f":"IF(アプリ!AC5=\"\",\"\",アプリ!AC5)","v":""},{"$f":"IF(アプリ!AD5=\"\",\"\",アプリ!AD5)","v":""},{"$f":"IF(アプリ!AE5=\"\",\"\",アプリ!AE5)","v":""}]
[null,null,{"$f":"IF($H$8=\"\",\"\",MID(DEC2BIN($H$8,4),1,1))","v":""},{"$f":"IF($H$8=\"\",\"\",MID(DEC2BIN($H$8,4),2,1))","v":""},{"$f":"IF($H$8=\"\",\"\",MID(DEC2BIN($H$8,4),3,1))","v":""},{"$f":"IF($H$8=\"\",\"\",MID(DEC2BIN($H$8,4),4,1))","v":""},null,null,null,null,null,null,2,null,null,null,null,null,null,null,null,null,"",0,"",null,2,"WRITE A",12,1100,"1100","0001100","11001100","1","1","0","0","1","1","0","0",null,2,null,null,"","0000","0000000","",0,0,0,0,0,0,0,0,null,null,10,"ADD A",1010,"番地とレジスタAの和をレジスタAに書き込む",null,null,null,null,{"$f":"IF(アプリ!F6=\"\",\"\",アプリ!F6)","v":2},{"$f":"IF(アプリ!G6=\"\",\"\",アプリ!G6)","v":"WRITE A"},{"$f":"IF(アプリ!H6=\"\",\"\",アプリ!H6)","v":11},{"$f":"IF(アプリ!I6=\"\",\"\",アプリ!I6)","v":""},{"$f":"IF(アプリ!J6=\"\",\"\",アプリ!J6)","v":""},{"$f":"IF(アプリ!K6=\"\",\"\",アプリ!K6)","v":2},{"$f":"IF(アプリ!L6=\"\",\"\",アプリ!L6)","v":"ADD A"},{"$f":"IF(アプリ!M6=\"\",\"\",アプリ!M6)","v":12},{"$f":"IF(アプリ!N6=\"\",\"\",アプリ!N6)","v":""},{"$f":"IF(アプリ!O6=\"\",\"\",アプリ!O6)","v":""},{"$f":"IF(アプリ!P6=\"\",\"\",アプリ!P6)","v":2},{"$f":"IF(アプリ!Q6=\"\",\"\",アプリ!Q6)","v":"READ B"},{"$f":"IF(アプリ!R6=\"\",\"\",アプリ!R6)","v":11},{"$f":"IF(アプリ!S6=\"\",\"\",アプリ!S6)","v":""},{"$f":"IF(アプリ!T6=\"\",\"\",アプリ!T6)","v":""},{"$f":"IF(アプリ!U6=\"\",\"\",アプリ!U6)","v":2},{"$f":"IF(アプリ!V6=\"\",\"\",アプリ!V6)","v":"BITSHIFT A"},{"$f":"IF(アプリ!W6=\"\",\"\",アプリ!W6)","v":2},{"$f":"IF(アプリ!X6=\"\",\"\",アプリ!X6)","v":""},{"$f":"IF(アプリ!Y6=\"\",\"\",アプリ!Y6)","v":""},{"$f":"IF(アプリ!Z6=\"\",\"\",アプリ!Z6)","v":2},{"$f":"IF(アプリ!AA6=\"\",\"\",アプリ!AA6)","v":""},{"$f":"IF(アプリ!AB6=\"\",\"\",アプリ!AB6)","v":""},{"$f":"IF(アプリ!AC6=\"\",\"\",アプリ!AC6)","v":""},{"$f":"IF(アプリ!AD6=\"\",\"\",アプリ!AD6)","v":""},{"$f":"IF(アプリ!AE6=\"\",\"\",アプリ!AE6)","v":""}]
[null,"命令レジスタ",null,null,null,null,null,null,null,null,null,null,3,null,null,null,null,null,null,null,null,null,"",0,"",null,3,"OUTPUT",12,1110,{"$f":"IF(AC9<16,DEC2BIN(AC9,4),0)","v":"1100"},"0001100","11101100","1","1","1","0","1","1","0","0",null,3,null,null,"","0000","0000000","",0,0,0,0,0,0,0,0,null,null,11,"BITSHIFT A",1011,"ビット分レジスタAの値を左シフト",null,null,null,null,{"$f":"IF(アプリ!F7=\"\",\"\",アプリ!F7)","v":3},{"$f":"IF(アプリ!G7=\"\",\"\",アプリ!G7)","v":"BITSHIFT A"},{"$f":"IF(アプリ!H7=\"\",\"\",アプリ!H7)","v":1},{"$f":"IF(アプリ!I7=\"\",\"\",アプリ!I7)","v":""},{"$f":"IF(アプリ!J7=\"\",\"\",アプリ!J7)","v":""},{"$f":"IF(アプリ!K7=\"\",\"\",アプリ!K7)","v":3},{"$f":"IF(アプリ!L7=\"\",\"\",アプリ!L7)","v":"WRITE A"},{"$f":"IF(アプリ!M7=\"\",\"\",アプリ!M7)","v":13},{"$f":"IF(アプリ!N7=\"\",\"\",アプリ!N7)","v":""},{"$f":"IF(アプリ!O7=\"\",\"\",アプリ!O7)","v":""},{"$f":"IF(アプリ!P7=\"\",\"\",アプリ!P7)","v":3},{"$f":"IF(アプリ!Q7=\"\",\"\",アプリ!Q7)","v":"WRITE A"},{"$f":"IF(アプリ!R7=\"\",\"\",アプリ!R7)","v":11},{"$f":"IF(アプリ!S7=\"\",\"\",アプリ!S7)","v":""},{"$f":"IF(アプリ!T7=\"\",\"\",アプリ!T7)","v":""},{"$f":"IF(アプリ!U7=\"\",\"\",アプリ!U7)","v":3},{"$f":"IF(アプリ!V7=\"\",\"\",アプリ!V7)","v":"ADD A"},{"$f":"IF(アプリ!W7=\"\",\"\",アプリ!W7)","v":11},{"$f":"IF(アプリ!X7=\"\",\"\",アプリ!X7)","v":""},{"$f":"IF(アプリ!Y7=\"\",\"\",アプリ!Y7)","v":""},{"$f":"IF(アプリ!Z7=\"\",\"\",アプリ!Z7)","v":3},{"$f":"IF(アプリ!AA7=\"\",\"\",アプリ!AA7)","v":""},{"$f":"IF(アプリ!AB7=\"\",\"\",アプリ!AB7)","v":""},{"$f":"IF(アプリ!AC7=\"\",\"\",アプリ!AC7)","v":""},{"$f":"IF(アプリ!AD7=\"\",\"\",アプリ!AD7)","v":""},{"$f":"IF(アプリ!AE7=\"\",\"\",アプリ!AE7)","v":""}]
[null,null,null,null,null,null,null,{"$f":"IF(C10=\"\",\"\",F10*1+E10*2+D10*4+C10*8)","v":""},null,null,null,null,4,null,null,null,null,null,null,null,null,null,"",0,"",null,4,"STOP",null,1111,"0000","0000000","11110000","1","1","1","1","0","0","0","0",null,4,null,null,"","0000","0000000","",0,0,0,0,0,0,0,0,null,null,12,"WRITE A",1100,"番地へレジスタAから書き込む",null,null,null,null,{"$f":"IF(アプリ!F8=\"\",\"\",アプリ!F8)","v":4},{"$f":"IF(アプリ!G8=\"\",\"\",アプリ!G8)","v":"WRITE A"},{"$f":"IF(アプリ!H8=\"\",\"\",アプリ!H8)","v":12},{"$f":"IF(アプリ!I8=\"\",\"\",アプリ!I8)","v":""},{"$f":"IF(アプリ!J8=\"\",\"\",アプリ!J8)","v":""},{"$f":"IF(アプリ!K8=\"\",\"\",アプリ!K8)","v":4},{"$f":"IF(アプリ!L8=\"\",\"\",アプリ!L8)","v":"OUTPUT"},{"$f":"IF(アプリ!M8=\"\",\"\",アプリ!M8)","v":13},{"$f":"IF(アプリ!N8=\"\",\"\",アプリ!N8)","v":""},{"$f":"IF(アプリ!O8=\"\",\"\",アプリ!O8)","v":""},{"$f":"IF(アプリ!P8=\"\",\"\",アプリ!P8)","v":4},{"$f":"IF(アプリ!Q8=\"\",\"\",アプリ!Q8)","v":"WRITE B"},{"$f":"IF(アプリ!R8=\"\",\"\",アプリ!R8)","v":10},{"$f":"IF(アプリ!S8=\"\",\"\",アプリ!S8)","v":""},{"$f":"IF(アプリ!T8=\"\",\"\",アプリ!T8)","v":""},{"$f":"IF(アプリ!U8=\"\",\"\",アプリ!U8)","v":4},{"$f":"IF(アプリ!V8=\"\",\"\",アプリ!V8)","v":"ADD A"},{"$f":"IF(アプリ!W8=\"\",\"\",アプリ!W8)","v":12},{"$f":"IF(アプリ!X8=\"\",\"\",アプリ!X8)","v":""},{"$f":"IF(アプリ!Y8=\"\",\"\",アプリ!Y8)","v":""},{"$f":"IF(アプリ!Z8=\"\",\"\",アプリ!Z8)","v":4},{"$f":"IF(アプリ!AA8=\"\",\"\",アプリ!AA8)","v":""},{"$f":"IF(アプリ!AB8=\"\",\"\",アプリ!AB8)","v":""},{"$f":"IF(アプリ!AC8=\"\",\"\",アプリ!AC8)","v":""},{"$f":"IF(アプリ!AD8=\"\",\"\",アプリ!AD8)","v":""},{"$f":"IF(アプリ!AE8=\"\",\"\",アプリ!AE8)","v":""}]
[null,"命令解読器",null,null,null,null,null,null,null,null,null,null,5,null,null,null,null,null,null,null,null,null,"",0,"",null,5,null,null,"","0000","0000000","",0,0,0,0,0,0,0,0,null,5,null,null,"","0000","0000000","",0,0,0,0,0,0,0,0,null,null,13,"WRITE B",1101,"番地へレジスタBから書き込む",null,null,null,null,{"$f":"IF(アプリ!F9=\"\",\"\",アプリ!F9)","v":5},{"$f":"IF(アプリ!G9=\"\",\"\",アプリ!G9)","v":"ADD A"},{"$f":"IF(アプリ!H9=\"\",\"\",アプリ!H9)","v":11},{"$f":"IF(アプリ!I9=\"\",\"\",アプリ!I9)","v":""},{"$f":"IF(アプリ!J9=\"\",\"\",アプリ!J9)","v":""},{"$f":"IF(アプリ!K9=\"\",\"\",アプリ!K9)","v":5},{"$f":"IF(アプリ!L9=\"\",\"\",アプリ!L9)","v":"STOP"},{"$f":"IF(アプリ!M9=\"\",\"\",アプリ!M9)","v":""},{"$f":"IF(アプリ!N9=\"\",\"\",アプリ!N9)","v":""},{"$f":"IF(アプリ!O9=\"\",\"\",アプリ!O9)","v":""},{"$f":"IF(アプリ!P9=\"\",\"\",アプリ!P9)","v":5},{"$f":"IF(アプリ!Q9=\"\",\"\",アプリ!Q9)","v":"OUTPUT"},{"$f":"IF(アプリ!R9=\"\",\"\",アプリ!R9)","v":10},{"$f":"IF(アプリ!S9=\"\",\"\",アプリ!S9)","v":""},{"$f":"IF(アプリ!T9=\"\",\"\",アプリ!T9)","v":""},{"$f":"IF(アプリ!U9=\"\",\"\",アプリ!U9)","v":5},{"$f":"IF(アプリ!V9=\"\",\"\",アプリ!V9)","v":"ADD A"},{"$f":"IF(アプリ!W9=\"\",\"\",アプリ!W9)","v":13},{"$f":"IF(アプリ!X9=\"\",\"\",アプリ!X9)","v":""},{"$f":"IF(アプリ!Y9=\"\",\"\",アプリ!Y9)","v":""},{"$f":"IF(アプリ!Z9=\"\",\"\",アプリ!Z9)","v":5},{"$f":"IF(アプリ!AA9=\"\",\"\",アプリ!AA9)","v":""},{"$f":"IF(アプリ!AB9=\"\",\"\",アプリ!AB9)","v":""},{"$f":"IF(アプリ!AC9=\"\",\"\",アプリ!AC9)","v":""},{"$f":"IF(アプリ!AD9=\"\",\"\",アプリ!AD9)","v":""},{"$f":"IF(アプリ!AE9=\"\",\"\",アプリ!AE9)","v":""}]
[null,null,{"$f":"IF(K12=\"\",\"\",K12&VLOOKUP(H10,BH5:BK13,4,FALSE))","v":""},null,null,null,null,null,null,null,null,null,6,null,null,null,null,null,null,null,null,null,"",0,"",null,6,null,null,"","0000","0000000","",0,0,0,0,0,0,0,0,null,6,null,null,"","0000","0000000","",0,0,0,0,0,0,0,0,null,null,14,"OUTPUT",1110,"番地を出力装置に出力",null,null,null,null,{"$f":"IF(アプリ!F10=\"\",\"\",アプリ!F10)","v":6},{"$f":"IF(アプリ!G10=\"\",\"\",アプリ!G10)","v":"WRITE A"},{"$f":"IF(アプリ!H10=\"\",\"\",アプリ!H10)","v":13},{"$f":"IF(アプリ!I10=\"\",\"\",アプリ!I10)","v":""},{"$f":"IF(アプリ!J10=\"\",\"\",アプリ!J10)","v":""},{"$f":"IF(アプリ!K10=\"\",\"\",アプリ!K10)","v":6},{"$f":"IF(アプリ!L10=\"\",\"\",アプリ!L10)","v":""},{"$f":"IF(アプリ!M10=\"\",\"\",アプリ!M10)","v":""},{"$f":"IF(アプリ!N10=\"\",\"\",アプリ!N10)","v":""},{"$f":"IF(アプリ!O10=\"\",\"\",アプリ!O10)","v":""},{"$f":"IF(アプリ!P10=\"\",\"\",アプリ!P10)","v":6},{"$f":"IF(アプリ!Q10=\"\",\"\",アプリ!Q10)","v":"STOP"},{"$f":"IF(アプリ!R10=\"\",\"\",アプリ!R10)","v":""},{"$f":"IF(アプリ!S10=\"\",\"\",アプリ!S10)","v":""},{"$f":"IF(アプリ!T10=\"\",\"\",アプリ!T10)","v":""},{"$f":"IF(アプリ!U10=\"\",\"\",アプリ!U10)","v":6},{"$f":"IF(アプリ!V10=\"\",\"\",アプリ!V10)","v":"ADD A"},{"$f":"IF(アプリ!W10=\"\",\"\",アプリ!W10)","v":14},{"$f":"IF(アプリ!X10=\"\",\"\",アプリ!X10)","v":""},{"$f":"IF(アプリ!Y10=\"\",\"\",アプリ!Y10)","v":""},{"$f":"IF(アプリ!Z10=\"\",\"\",アプリ!Z10)","v":6},{"$f":"IF(アプリ!AA10=\"\",\"\",アプリ!AA10)","v":""},{"$f":"IF(アプリ!AB10=\"\",\"\",アプリ!AB10)","v":""},{"$f":"IF(アプリ!AC10=\"\",\"\",アプリ!AC10)","v":""},{"$f":"IF(アプリ!AD10=\"\",\"\",アプリ!AD10)","v":""},{"$f":"IF(アプリ!AE10=\"\",\"\",アプリ!AE10)","v":""}]
[null,null,null,null,null,null,null,null,null,null,null,null,7,null,null,null,null,null,null,null,null,null,"",0,"",null,7,null,null,"","0000","0000000","",0,0,0,0,0,0,0,0,null,7,null,null,"","0000","0000000","",0,0,0,0,0,0,0,0,null,null,15,"STOP",1111,"…プログラムの停止",null,null,null,null,{"$f":"IF(アプリ!F11=\"\",\"\",アプリ!F11)","v":7},{"$f":"IF(アプリ!G11=\"\",\"\",アプリ!G11)","v":"OUTPUT"},{"$f":"IF(アプリ!H11=\"\",\"\",アプリ!H11)","v":13},{"$f":"IF(アプリ!I11=\"\",\"\",アプリ!I11)","v":""},{"$f":"IF(アプリ!J11=\"\",\"\",アプリ!J11)","v":""},{"$f":"IF(アプリ!K11=\"\",\"\",アプリ!K11)","v":7},{"$f":"IF(アプリ!L11=\"\",\"\",アプリ!L11)","v":""},{"$f":"IF(アプリ!M11=\"\",\"\",アプリ!M11)","v":""},{"$f":"IF(アプリ!N11=\"\",\"\",アプリ!N11)","v":""},{"$f":"IF(アプリ!O11=\"\",\"\",アプリ!O11)","v":""},{"$f":"IF(アプリ!P11=\"\",\"\",アプリ!P11)","v":7},{"$f":"IF(アプリ!Q11=\"\",\"\",アプリ!Q11)","v":""},{"$f":"IF(アプリ!R11=\"\",\"\",アプリ!R11)","v":""},{"$f":"IF(アプリ!S11=\"\",\"\",アプリ!S11)","v":""},{"$f":"IF(アプリ!T11=\"\",\"\",アプリ!T11)","v":""},{"$f":"IF(アプリ!U11=\"\",\"\",アプリ!U11)","v":7},{"$f":"IF(アプリ!V11=\"\",\"\",アプリ!V11)","v":"WRITE A"},{"$f":"IF(アプリ!W11=\"\",\"\",アプリ!W11)","v":15},{"$f":"IF(アプリ!X11=\"\",\"\",アプリ!X11)","v":""},{"$f":"IF(アプリ!Y11=\"\",\"\",アプリ!Y11)","v":""},{"$f":"IF(アプリ!Z11=\"\",\"\",アプリ!Z11)","v":7},{"$f":"IF(アプリ!AA11=\"\",\"\",アプリ!AA11)","v":""},{"$f":"IF(アプリ!AB11=\"\",\"\",アプリ!AB11)","v":""},{"$f":"IF(アプリ!AC11=\"\",\"\",アプリ!AC11)","v":""},{"$f":"IF(アプリ!AD11=\"\",\"\",アプリ!AD11)","v":""},{"$f":"IF(アプリ!AE11=\"\",\"\",アプリ!AE11)","v":""}]
[null,null,null,null,null,null,null,null,null,null,null,null,8,null,null,null,null,null,null,null,null,null,"",0,"",null,8,null,null,"","0000","0000000","",0,0,0,0,0,0,0,0,null,8,null,null,"","0000","0000000","",0,0,0,0,0,0,0,0,null,null,null,null,"先頭のビットが1のものを命令として認識します。",null,null,null,null,null,{"$f":"IF(アプリ!F12=\"\",\"\",アプリ!F12)","v":8},{"$f":"IF(アプリ!G12=\"\",\"\",アプリ!G12)","v":"STOP"},{"$f":"IF(アプリ!H12=\"\",\"\",アプリ!H12)","v":""},{"$f":"IF(アプリ!I12=\"\",\"\",アプリ!I12)","v":""},{"$f":"IF(アプリ!J12=\"\",\"\",アプリ!J12)","v":""},{"$f":"IF(アプリ!K12=\"\",\"\",アプリ!K12)","v":8},{"$f":"IF(アプリ!L12=\"\",\"\",アプリ!L12)","v":""},{"$f":"IF(アプリ!M12=\"\",\"\",アプリ!M12)","v":""},{"$f":"IF(アプリ!N12=\"\",\"\",アプリ!N12)","v":""},{"$f":"IF(アプリ!O12=\"\",\"\",アプリ!O12)","v":""},{"$f":"IF(アプリ!P12=\"\",\"\",アプリ!P12)","v":8},{"$f":"IF(アプリ!Q12=\"\",\"\",アプリ!Q12)","v":""},{"$f":"IF(アプリ!R12=\"\",\"\",アプリ!R12)","v":""},{"$f":"IF(アプリ!S12=\"\",\"\",アプリ!S12)","v":""},{"$f":"IF(アプリ!T12=\"\",\"\",アプリ!T12)","v":""},{"$f":"IF(アプリ!U12=\"\",\"\",アプリ!U12)","v":8},{"$f":"IF(アプリ!V12=\"\",\"\",アプリ!V12)","v":"OUTPUT"},{"$f":"IF(アプリ!W12=\"\",\"\",アプリ!W12)","v":15},{"$f":"IF(アプリ!X12=\"\",\"\",アプリ!X12)","v":""},{"$f":"IF(アプリ!Y12=\"\",\"\",アプリ!Y12)","v":""},{"$f":"IF(アプリ!Z12=\"\",\"\",アプリ!Z12)","v":8},{"$f":"IF(アプリ!AA12=\"\",\"\",アプリ!AA12)","v":""},{"$f":"IF(アプリ!AB12=\"\",\"\",アプリ!AB12)","v":""},{"$f":"IF(アプリ!AC12=\"\",\"\",アプリ!AC12)","v":""},{"$f":"IF(アプリ!AD12=\"\",\"\",アプリ!AD12)","v":""},{"$f":"IF(アプリ!AE12=\"\",\"\",アプリ!AE12)","v":""}]
[null,null,null,null,null,null,null,null,null,null,null,null,9,null,null,null,null,null,null,null,null,null,"",0,"",null,9,null,null,"","0000","0000000","",0,0,0,0,0,0,0,0,null,9,null,null,"","0000","0000000","",0,0,0,0,0,0,0,0,null,null,null,null,null,null,null,null,null,null,{"$f":"IF(アプリ!F13=\"\",\"\",アプリ!F13)","v":9},{"$f":"IF(アプリ!G13=\"\",\"\",アプリ!G13)","v":""},{"$f":"IF(アプリ!H13=\"\",\"\",アプリ!H13)","v":""},{"$f":"IF(アプリ!I13=\"\",\"\",アプリ!I13)","v":""},{"$f":"IF(アプリ!J13=\"\",\"\",アプリ!J13)","v":""},{"$f":"IF(アプリ!K13=\"\",\"\",アプリ!K13)","v":9},{"$f":"IF(アプリ!L13=\"\",\"\",アプリ!L13)","v":""},{"$f":"IF(アプリ!M13=\"\",\"\",アプリ!M13)","v":""},{"$f":"IF(アプリ!N13=\"\",\"\",アプリ!N13)","v":""},{"$f":"IF(アプリ!O13=\"\",\"\",アプリ!O13)","v":""},{"$f":"IF(アプリ!P13=\"\",\"\",アプリ!P13)","v":9},{"$f":"IF(アプリ!Q13=\"\",\"\",アプリ!Q13)","v":""},{"$f":"IF(アプリ!R13=\"\",\"\",アプリ!R13)","v":""},{"$f":"IF(アプリ!S13=\"\",\"\",アプリ!S13)","v":""},{"$f":"IF(アプリ!T13=\"\",\"\",アプリ!T13)","v":""},{"$f":"IF(アプリ!U13=\"\",\"\",アプリ!U13)","v":9},{"$f":"IF(アプリ!V13=\"\",\"\",アプリ!V13)","v":"STOP"},{"$f":"IF(アプリ!W13=\"\",\"\",アプリ!W13)","v":""},{"$f":"IF(アプリ!X13=\"\",\"\",アプリ!X13)","v":""},{"$f":"IF(アプリ!Y13=\"\",\"\",アプリ!Y13)","v":""},{"$f":"IF(アプリ!Z13=\"\",\"\",アプリ!Z13)","v":9},{"$f":"IF(アプリ!AA13=\"\",\"\",アプリ!AA13)","v":""},{"$f":"IF(アプリ!AB13=\"\",\"\",アプリ!AB13)","v":""},{"$f":"IF(アプリ!AC13=\"\",\"\",アプリ!AC13)","v":""},{"$f":"IF(アプリ!AD13=\"\",\"\",アプリ!AD13)","v":""},{"$f":"IF(アプリ!AE13=\"\",\"\",アプリ!AE13)","v":""}]
[null,"レジスタA",null,null,null,null,null,null,null,null,null,null,10,null,null,null,null,null,null,null,null,null,"",0,"",null,10,"値",3,0,"0011","0000011","00000011","0","0","0","0","0","0","1","1",null,10,null,null,"","0000","0000000","",0,0,0,0,0,0,0,0,null,null,null,null,null,null,null,null,null,null,{"$f":"IF(アプリ!F14=\"\",\"\",アプリ!F14)","v":10},{"$f":"IF(アプリ!G14=\"\",\"\",アプリ!G14)","v":"値"},{"$f":"IF(アプリ!H14=\"\",\"\",アプリ!H14)","v":5},{"$f":"IF(アプリ!I14=\"\",\"\",アプリ!I14)","v":""},{"$f":"IF(アプリ!J14=\"\",\"\",アプリ!J14)","v":""},{"$f":"IF(アプリ!K14=\"\",\"\",アプリ!K14)","v":10},{"$f":"IF(アプリ!L14=\"\",\"\",アプリ!L14)","v":"値"},{"$f":"IF(アプリ!M14=\"\",\"\",アプリ!M14)","v":3},{"$f":"IF(アプリ!N14=\"\",\"\",アプリ!N14)","v":""},{"$f":"IF(アプリ!O14=\"\",\"\",アプリ!O14)","v":""},{"$f":"IF(アプリ!P14=\"\",\"\",アプリ!P14)","v":10},{"$f":"IF(アプリ!Q14=\"\",\"\",アプリ!Q14)","v":"値"},{"$f":"IF(アプリ!R14=\"\",\"\",アプリ!R14)","v":3},{"$f":"IF(アプリ!S14=\"\",\"\",アプリ!S14)","v":""},{"$f":"IF(アプリ!T14=\"\",\"\",アプリ!T14)","v":""},{"$f":"IF(アプリ!U14=\"\",\"\",アプリ!U14)","v":10},{"$f":"IF(アプリ!V14=\"\",\"\",アプリ!V14)","v":"値"},{"$f":"IF(アプリ!W14=\"\",\"\",アプリ!W14)","v":3},{"$f":"IF(アプリ!X14=\"\",\"\",アプリ!X14)","v":""},{"$f":"IF(アプリ!Y14=\"\",\"\",アプリ!Y14)","v":""},{"$f":"IF(アプリ!Z14=\"\",\"\",アプリ!Z14)","v":10},{"$f":"IF(アプリ!AA14=\"\",\"\",アプリ!AA14)","v":""},{"$f":"IF(アプリ!AB14=\"\",\"\",アプリ!AB14)","v":""},{"$f":"IF(アプリ!AC14=\"\",\"\",アプリ!AC14)","v":""},{"$f":"IF(アプリ!AD14=\"\",\"\",アプリ!AD14)","v":""},{"$f":"IF(アプリ!AE14=\"\",\"\",アプリ!AE14)","v":""}]
[null,null,null,null,null,null,null,null,null,null,{"$f":"IF(J17=\"\",\"\",SUMPRODUCT(C17:J17,$C$27:$J$27))","v":""},null,11,null,null,null,null,null,null,null,null,null,"",0,"",null,11,"値",5,0,"0101","0000101","00000101","0","0","0","0","0","1","0","1",null,11,null,null,"","0000","0000000","",0,0,0,0,0,0,0,0,null,null,"プログラムの「ダウンロード」",null,null,null,null,null,null,null,{"$f":"IF(アプリ!F15=\"\",\"\",アプリ!F15)","v":11},{"$f":"IF(アプリ!G15=\"\",\"\",アプリ!G15)","v":""},{"$f":"IF(アプリ!H15=\"\",\"\",アプリ!H15)","v":""},{"$f":"IF(アプリ!I15=\"\",\"\",アプリ!I15)","v":""},{"$f":"IF(アプリ!J15=\"\",\"\",アプリ!J15)","v":""},{"$f":"IF(アプリ!K15=\"\",\"\",アプリ!K15)","v":11},{"$f":"IF(アプリ!L15=\"\",\"\",アプリ!L15)","v":"値"},{"$f":"IF(アプリ!M15=\"\",\"\",アプリ!M15)","v":5},{"$f":"IF(アプリ!N15=\"\",\"\",アプリ!N15)","v":""},{"$f":"IF(アプリ!O15=\"\",\"\",アプリ!O15)","v":""},{"$f":"IF(アプリ!P15=\"\",\"\",アプリ!P15)","v":11},{"$f":"IF(アプリ!Q15=\"\",\"\",アプリ!Q15)","v":"値"},{"$f":"IF(アプリ!R15=\"\",\"\",アプリ!R15)","v":5},{"$f":"IF(アプリ!S15=\"\",\"\",アプリ!S15)","v":""},{"$f":"IF(アプリ!T15=\"\",\"\",アプリ!T15)","v":""},{"$f":"IF(アプリ!U15=\"\",\"\",アプリ!U15)","v":11},{"$f":"IF(アプリ!V15=\"\",\"\",アプリ!V15)","v":"値"},{"$f":"IF(アプリ!W15=\"\",\"\",アプリ!W15)","v":5},{"$f":"IF(アプリ!X15=\"\",\"\",アプリ!X15)","v":""},{"$f":"IF(アプリ!Y15=\"\",\"\",アプリ!Y15)","v":""},{"$f":"IF(アプリ!Z15=\"\",\"\",アプリ!Z15)","v":11},{"$f":"IF(アプリ!AA15=\"\",\"\",アプリ!AA15)","v":""},{"$f":"IF(アプリ!AB15=\"\",\"\",アプリ!AB15)","v":""},{"$f":"IF(アプリ!AC15=\"\",\"\",アプリ!AC15)","v":""},{"$f":"IF(アプリ!AD15=\"\",\"\",アプリ!AD15)","v":""},{"$f":"IF(アプリ!AE15=\"\",\"\",アプリ!AE15)","v":""}]
[null,"レジスタB",null,null,null,null,null,null,null,null,null,null,12,null,null,null,null,null,null,null,null,null,"",0,"",null,12,null,null,"","0000","0000000","",0,0,0,0,0,0,0,0,null,12,null,null,"","0000","0000000","",0,0,0,0,0,0,0,0,null,null,"プログラム4",null,null,{"$f":"VLOOKUP('８ビットコンピュータ'!BH18,アプリ!C2:D7,2,FALSE)","v":4},null,null,null,null,{"$f":"IF(アプリ!F16=\"\",\"\",アプリ!F16)","v":12},{"$f":"IF(アプリ!G16=\"\",\"\",アプリ!G16)","v":""},{"$f":"IF(アプリ!H16=\"\",\"\",アプリ!H16)","v":""},{"$f":"IF(アプリ!I16=\"\",\"\",アプリ!I16)","v":""},{"$f":"IF(アプリ!J16=\"\",\"\",アプリ!J16)","v":""},{"$f":"IF(アプリ!K16=\"\",\"\",アプリ!K16)","v":12},{"$f":"IF(アプリ!L16=\"\",\"\",アプリ!L16)","v":"値"},{"$f":"IF(アプリ!M16=\"\",\"\",アプリ!M16)","v":10},{"$f":"IF(アプリ!N16=\"\",\"\",アプリ!N16)","v":""},{"$f":"IF(アプリ!O16=\"\",\"\",アプリ!O16)","v":""},{"$f":"IF(アプリ!P16=\"\",\"\",アプリ!P16)","v":12},{"$f":"IF(アプリ!Q16=\"\",\"\",アプリ!Q16)","v":""},{"$f":"IF(アプリ!R16=\"\",\"\",アプリ!R16)","v":""},{"$f":"IF(アプリ!S16=\"\",\"\",アプリ!S16)","v":""},{"$f":"IF(アプリ!T16=\"\",\"\",アプリ!T16)","v":""},{"$f":"IF(アプリ!U16=\"\",\"\",アプリ!U16)","v":12},{"$f":"IF(アプリ!V16=\"\",\"\",アプリ!V16)","v":"値"},{"$f":"IF(アプリ!W16=\"\",\"\",アプリ!W16)","v":10},{"$f":"IF(アプリ!X16=\"\",\"\",アプリ!X16)","v":""},{"$f":"IF(アプリ!Y16=\"\",\"\",アプリ!Y16)","v":""},{"$f":"IF(アプリ!Z16=\"\",\"\",アプリ!Z16)","v":12},{"$f":"IF(アプリ!AA16=\"\",\"\",アプリ!AA16)","v":""},{"$f":"IF(アプリ!AB16=\"\",\"\",アプリ!AB16)","v":""},{"$f":"IF(アプリ!AC16=\"\",\"\",アプリ!AC16)","v":""},{"$f":"IF(アプリ!AD16=\"\",\"\",アプリ!AD16)","v":""},{"$f":"IF(アプリ!AE16=\"\",\"\",アプリ!AE16)","v":""}]
[null,null,null,null,null,null,null,null,null,null,{"$f":"IF(J19=\"\",\"\",SUMPRODUCT(C19:J19,$C$27:$J$27))","v":""},null,13,null,null,null,null,null,null,null,null,null,"",0,"",null,13,null,null,"","0000","0000000","",0,0,0,0,0,0,0,0,null,13,null,null,"","0000","0000000","",0,0,0,0,0,0,0,0,null,null,null,null,null,null,null,null,null,null,{"$f":"IF(アプリ!F17=\"\",\"\",アプリ!F17)","v":13},{"$f":"IF(アプリ!G17=\"\",\"\",アプリ!G17)","v":""},{"$f":"IF(アプリ!H17=\"\",\"\",アプリ!H17)","v":""},{"$f":"IF(アプリ!I17=\"\",\"\",アプリ!I17)","v":""},{"$f":"IF(アプリ!J17=\"\",\"\",アプリ!J17)","v":""},{"$f":"IF(アプリ!K17=\"\",\"\",アプリ!K17)","v":13},{"$f":"IF(アプリ!L17=\"\",\"\",アプリ!L17)","v":""},{"$f":"IF(アプリ!M17=\"\",\"\",アプリ!M17)","v":""},{"$f":"IF(アプリ!N17=\"\",\"\",アプリ!N17)","v":""},{"$f":"IF(アプリ!O17=\"\",\"\",アプリ!O17)","v":""},{"$f":"IF(アプリ!P17=\"\",\"\",アプリ!P17)","v":13},{"$f":"IF(アプリ!Q17=\"\",\"\",アプリ!Q17)","v":""},{"$f":"IF(アプリ!R17=\"\",\"\",アプリ!R17)","v":""},{"$f":"IF(アプリ!S17=\"\",\"\",アプリ!S17)","v":""},{"$f":"IF(アプリ!T17=\"\",\"\",アプリ!T17)","v":""},{"$f":"IF(アプリ!U17=\"\",\"\",アプリ!U17)","v":13},{"$f":"IF(アプリ!V17=\"\",\"\",アプリ!V17)","v":"値"},{"$f":"IF(アプリ!W17=\"\",\"\",アプリ!W17)","v":12},{"$f":"IF(アプリ!X17=\"\",\"\",アプリ!X17)","v":""},{"$f":"IF(アプリ!Y17=\"\",\"\",アプリ!Y17)","v":""},{"$f":"IF(アプリ!Z17=\"\",\"\",アプリ!Z17)","v":13},{"$f":"IF(アプリ!AA17=\"\",\"\",アプリ!AA17)","v":""},{"$f":"IF(アプリ!AB17=\"\",\"\",アプリ!AB17)","v":""},{"$f":"IF(アプリ!AC17=\"\",\"\",アプリ!AC17)","v":""},{"$f":"IF(アプリ!AD17=\"\",\"\",アプリ!AD17)","v":""},{"$f":"IF(アプリ!AE17=\"\",\"\",アプリ!AE17)","v":""}]
[null,"演算装置",null,null,null,null,null,null,null,null,null,null,14,null,null,null,null,null,null,null,null,null,"",0,"",null,14,null,null,"","0000","0000000","",0,0,0,0,0,0,0,0,null,14,null,null,"","0000","0000000","",0,0,0,0,0,0,0,0,null,null,null,null,null,null,null,null,null,null,{"$f":"IF(アプリ!F18=\"\",\"\",アプリ!F18)","v":14},{"$f":"IF(アプリ!G18=\"\",\"\",アプリ!G18)","v":""},{"$f":"IF(アプリ!H18=\"\",\"\",アプリ!H18)","v":""},{"$f":"IF(アプリ!I18=\"\",\"\",アプリ!I18)","v":""},{"$f":"IF(アプリ!J18=\"\",\"\",アプリ!J18)","v":""},{"$f":"IF(アプリ!K18=\"\",\"\",アプリ!K18)","v":14},{"$f":"IF(アプリ!L18=\"\",\"\",アプリ!L18)","v":""},{"$f":"IF(アプリ!M18=\"\",\"\",アプリ!M18)","v":""},{"$f":"IF(アプリ!N18=\"\",\"\",アプリ!N18)","v":""},{"$f":"IF(アプリ!O18=\"\",\"\",アプリ!O18)","v":""},{"$f":"IF(アプリ!P18=\"\",\"\",アプリ!P18)","v":14},{"$f":"IF(アプリ!Q18=\"\",\"\",アプリ!Q18)","v":""},{"$f":"IF(アプリ!R18=\"\",\"\",アプリ!R18)","v":""},{"$f":"IF(アプリ!S18=\"\",\"\",アプリ!S18)","v":""},{"$f":"IF(アプリ!T18=\"\",\"\",アプリ!T18)","v":""},{"$f":"IF(アプリ!U18=\"\",\"\",アプリ!U18)","v":14},{"$f":"IF(アプリ!V18=\"\",\"\",アプリ!V18)","v":"値"},{"$f":"IF(アプリ!W18=\"\",\"\",アプリ!W18)","v":13},{"$f":"IF(アプリ!X18=\"\",\"\",アプリ!X18)","v":""},{"$f":"IF(アプリ!Y18=\"\",\"\",アプリ!Y18)","v":""},{"$f":"IF(アプリ!Z18=\"\",\"\",アプリ!Z18)","v":14},{"$f":"IF(アプリ!AA18=\"\",\"\",アプリ!AA18)","v":""},{"$f":"IF(アプリ!AB18=\"\",\"\",アプリ!AB18)","v":""},{"$f":"IF(アプリ!AC18=\"\",\"\",アプリ!AC18)","v":""},{"$f":"IF(アプリ!AD18=\"\",\"\",アプリ!AD18)","v":""},{"$f":"IF(アプリ!AE18=\"\",\"\",アプリ!AE18)","v":""}]
[null,null,"加算器",null,null,null,null,null,null,null,null,null,15,null,null,null,null,null,null,null,null,null,"",0,"",null,15,null,null,"","0000","0000000","",0,0,0,0,0,0,0,0,null,15,null,null,"","0000","0000000","",0,0,0,0,0,0,0,0,null,null,null,null,null,null,null,null,null,null,{"$f":"IF(アプリ!F19=\"\",\"\",アプリ!F19)","v":15},{"$f":"IF(アプリ!G19=\"\",\"\",アプリ!G19)","v":""},{"$f":"IF(アプリ!H19=\"\",\"\",アプリ!H19)","v":""},{"$f":"IF(アプリ!I19=\"\",\"\",アプリ!I19)","v":""},{"$f":"IF(アプリ!J19=\"\",\"\",アプリ!J19)","v":""},{"$f":"IF(アプリ!K19=\"\",\"\",アプリ!K19)","v":15},{"$f":"IF(アプリ!L19=\"\",\"\",アプリ!L19)","v":""},{"$f":"IF(アプリ!M19=\"\",\"\",アプリ!M19)","v":""},{"$f":"IF(アプリ!N19=\"\",\"\",アプリ!N19)","v":""},{"$f":"IF(アプリ!O19=\"\",\"\",アプリ!O19)","v":""},{"$f":"IF(アプリ!P19=\"\",\"\",アプリ!P19)","v":15},{"$f":"IF(アプリ!Q19=\"\",\"\",アプリ!Q19)","v":""},{"$f":"IF(アプリ!R19=\"\",\"\",アプリ!R19)","v":""},{"$f":"IF(アプリ!S19=\"\",\"\",アプリ!S19)","v":""},{"$f":"IF(アプリ!T19=\"\",\"\",アプリ!T19)","v":""},{"$f":"IF(アプリ!U19=\"\",\"\",アプリ!U19)","v":15},{"$f":"IF(アプリ!V19=\"\",\"\",アプリ!V19)","v":""},{"$f":"IF(アプリ!W19=\"\",\"\",アプリ!W19)","v":""},{"$f":"IF(アプリ!X19=\"\",\"\",アプリ!X19)","v":""},{"$f":"IF(アプリ!Y19=\"\",\"\",アプリ!Y19)","v":""},{"$f":"IF(アプリ!Z19=\"\",\"\",アプリ!Z19)","v":15},{"$f":"IF(アプリ!AA19=\"\",\"\",アプリ!AA19)","v":""},{"$f":"IF(アプリ!AB19=\"\",\"\",アプリ!AB19)","v":""},{"$f":"IF(アプリ!AC19=\"\",\"\",アプリ!AC19)","v":""},{"$f":"IF(アプリ!AD19=\"\",\"\",アプリ!AD19)","v":""},{"$f":"IF(アプリ!AE19=\"\",\"\",アプリ!AE19)","v":""}]
[null,null,null,null,null,null,null,null,null,null,{"$f":"IF(J22=\"\",\"\",SUMPRODUCT(C22:J22,$C$27:$J$27))","v":""},null,null,null,null,null,null,null,null,null,null,null,null,null,null,null,null,null,null,"",null,null,null,{"$f":"CheckBinaryRange(AH6:AO21)","v":true},null,null,null,null,null,null,null,null,null,null,null,null,null,null,null,{"$f":"CheckBinaryRange(AX6:BE21)","v":true}]
[null,"+",null,null,null,null,null,null,null,null,{"$f":"IF(J23=\"\",\"\",SUMPRODUCT(C23:J23,$C$27:$J$27))","v":""}]
[null,null,{"$f":"IF($K$24=\"\",0,MID(DEC2BIN($K$24,8),C29,1))","v":0},{"$f":"IF($K$24=\"\",0,MID(DEC2BIN($K$24,8),D29,1))","v":0},0,0,0,0,0,0,{"$f":"IF(OR(K22=\"\",K23=\"\"),\"\",K22+K23)","v":""}]
[]
[null,null,2,3,4,5]
[null,null,0,64,32,16,8,4,2,1,null,null,{"$f":"IF(IF(ISERROR(N28),FALSE,N28),\"実行可\",\"実行できない\")","v":"実行できない"},{"$f":"IF(IF(ISERROR(T22),FALSE,T22),\"転送可能\",\"エラー\")","v":"エラー"},"エラー",null,null,null,null,null,null,null,null,null,null,null,null,{"$f":"IF(IF(ISERROR(AH22),FALSE,AH22),\"転送可能\",\"エラー\")","v":"転送可能"},null,null,null,null,null,null,null,null,null,null,null,null,null,null,null,{"$f":"IF(IF(ISERROR(AX22),FALSE,AX22),\"転送可能\",\"エラー\")","v":"転送可能"}]
[null,null,2,3,4,5,6,7,8,9,null,null,{"$f":"IF(ISERROR(N28),FALSE,N28)","v":false},{"$f":"CheckBinaryRange(N6:U21)","v":false}]
[null,null,1,2,3,4,5,6,7,8]
[]
[null,null,2,2]
[null,null,1,1]
[null,null,0.5]
[null,null,0.2]

{"sheet":"アプリ","index":1,"n_rows":19,"n_cols":28,"rows_kept":19,"cut":false,"hidden":false,"merged":[]}
[null,null,null,null,null,"アプリケーション１",null,null,null,null,"アプリケーション２",null,null,null,null,"アプリケーション3",null,null,null,null,"アプリケーション4",null,null,null,null,"アプリケーション5"]
[null,"番号","名前",null,null,"６倍するプログラム",null,null,null,null,"３つの数を足し合わせる",null,null,null,null,"メモリ上の値を入れ替える",null,null,null,null,"3×4+5+10+12+13",null,null,null,null,"プログラム５"]
[null,1,{"$f":"F2","v":"６倍するプログラム"},1,null,null,"命令","番地・値",null,null,null,"命令","番地・値",null,null,null,"命令","番地・値",null,null,null,"命令","番地・値",null,null,null,"命令","番地・値"]
[null,2,{"$f":"K2","v":"３つの数を足し合わせる"},2,null,0,"READ A",10,null,null,0,"READ A",10,null,null,0,"OUTPUT",10,null,null,0,"READ A",10,null,null,0]
[null,3,{"$f":"P2","v":"メモリ上の値を入れ替える"},3,null,1,"BITSHIFT A",1,null,null,1,"ADD A",11,null,null,1,"READ A",10,null,null,1,"READ B",10,null,null,1]
[null,4,"プログラム4",4,null,2,"WRITE A",11,null,null,2,"ADD A",12,null,null,2,"READ B",11,null,null,2,"BITSHIFT A",2,null,null,2]
[null,5,"プログラム5",5,null,3,"BITSHIFT A",1,null,null,3,"WRITE A",13,null,null,3,"WRITE A",11,null,null,3,"ADD A",11,null,null,3]
[null,null,null,null,null,4,"WRITE A",12,null,null,4,"OUTPUT",13,null,null,4,"WRITE B",10,null,null,4,"ADD A",12,null,null,4]
[null,null,null,null,null,5,"ADD A",11,null,null,5,"STOP",null,null,null,5,"OUTPUT",10,null,null,5,"ADD A",13,null,null,5]
[null,null,null,null,null,6,"WRITE A",13,null,null,6,null,null,null,null,6,"STOP",null,null,null,6,"ADD A",14,null,null,6]
[null,null,null,null,null,7,"OUTPUT",13,null,null,7,null,null,null,null,7,null,null,null,null,7,"WRITE A",15,null,null,7]
[null,null,null,null,null,8,"STOP",null,null,null,8,null,null,null,null,8,null,null,null,null,8,"OUTPUT",15,null,null,8]
[null,null,null,null,null,9,null,null,null,null,9,null,null,null,null,9,null,null,null,null,9,"STOP",null,null,null,9]
[null,null,null,null,null,10,"値",5,null,null,10,"値",3,null,null,10,"値",3,null,null,10,"値",3,null,null,10]
[null,null,"ここは",null,null,11,null,null,null,null,11,"値",5,null,null,11,"値",5,null,null,11,"値",5,null,null,11]
[null,null,"ウェブサーバーです。",null,null,12,null,null,null,null,12,"値",10,null,null,12,null,null,null,null,12,"値",10,null,null,12]
[null,null,null,null,null,13,null,null,null,null,13,null,null,null,null,13,null,null,null,null,13,"値",12,null,null,13]
[null,null,null,null,null,14,null,null,null,null,14,null,null,null,null,14,null,null,null,null,14,"値",13,null,null,14]
[null,null,null,null,null,15,null,null,null,null,15,null,null,null,null,15,null,null,null,null,15,null,null,null,null,15]

{"sheet":"仕様","index":2,"n_rows":21,"n_cols":7,"rows_kept":21,"cut":false,"hidden":true,"merged":[]}
[]
[null,"備忘録"]
[]
[null,"高等学校情報Ⅰの「コンピュータの動作」の指導のために作成されました。"]
[]
[null,null,null,null,null,null,"2023-05-16"]
[null,"データ長","8ビット"]
[null,"メモリ容量","16バイト"]
[null,"レジスタ","プログラムカウンタ　４ビット"]
[null,null,"命令レジスタ　４ビット"]
[null,null,"レジスタA　４ビット"]
[null,null,"レジスタB　４ビット"]
[null,"制御方式","逐次制御　プログラムは0番地開始固定"]
[null,"クロック周波数","およそ 0.2,  0.5,  1,  2Hz"]
[]
[null,"値の範囲","7ビット、正の整数"]
[null,null,"上位4ビット"]
[]
[null,"参考資料","http://www.infonet.co.jp/ueyama/ip/logic/howtouse.html"]
[]
[null,"　文責","樋掛　雅則（富山高校）"]